CRAN Package Check Results for Package devtools

Last updated on 2016-12-28 23:47:07.

Flavor Version Tinstall Tcheck Ttotal Status Flags
r-devel-linux-x86_64-debian-clang 1.12.0 2.62 78.70 81.32 OK
r-devel-linux-x86_64-debian-gcc 1.12.0 2.48 76.71 79.19 OK
r-devel-linux-x86_64-fedora-clang 1.12.0 136.08 OK --no-stop-on-test-error
r-devel-linux-x86_64-fedora-gcc 1.12.0 134.76 OK --no-stop-on-test-error
r-devel-macos-x86_64-clang 1.12.0 105.97 OK --no-stop-on-test-error
r-devel-windows-ix86+x86_64 1.12.0 15.00 355.00 370.00 WARN
r-patched-linux-x86_64 1.12.0 2.50 67.82 70.32 ERROR
r-patched-solaris-sparc 1.12.0 595.30 ERROR
r-patched-solaris-x86 1.12.0 144.80 ERROR
r-release-linux-x86_64 1.12.0 2.50 68.74 71.23 OK
r-release-osx-x86_64-mavericks 1.12.0 OK
r-release-windows-ix86+x86_64 1.12.0 17.00 279.00 296.00 OK
r-oldrel-windows-ix86+x86_64 1.12.0 11.00 205.00 216.00 OK

Check Details

Version: 1.12.0
Check: files in ‘vignettes’
Result: WARN
    Files in the 'vignettes' directory newer than all files in 'inst/doc':
     'dependencies.Rmd'
Flavor: r-devel-windows-ix86+x86_64

Version: 1.12.0
Check: tests
Result: ERROR
     Running ‘has-devel.R’ [1s/1s]
     Running ‘test-that.R’ [28s/30s]
    Running the tests in ‘tests/test-that.R’ failed.
    Last 13 lines of output:
     7: find_pkg_topic(path, topic)
     8: topic_index(pkg)
     9: build_topic_index(pkg)
     10: invert(lapply(rds, aliases))
    
     Updating collate directive in /tmp/RtmpabXVRd/testCollateOrder/DESCRIPTION
    
     testthat results ================================================================
     OK: 377 SKIPPED: 10 FAILED: 1
     1. Error: help and ? find files for devtools-loaded packages (@test-help.r#45)
    
     Error: testthat unit tests failed
     Execution halted
Flavor: r-patched-linux-x86_64

Version: 1.12.0
Check: tests
Result: ERROR
     Running ‘has-devel.R’
     Running ‘test-that.R’ [246s/249s]
    Running the tests in ‘tests/test-that.R’ failed.
    Last 13 lines of output:
     7: find_pkg_topic(path, topic)
     8: topic_index(pkg)
     9: build_topic_index(pkg)
     10: invert(lapply(rds, aliases))
    
     Updating collate directive in /tmp/RtmpfwaikY/testCollateOrder/DESCRIPTION
    
     testthat results ================================================================
     OK: 377 SKIPPED: 10 FAILED: 1
     1. Error: help and ? find files for devtools-loaded packages (@test-help.r#45)
    
     Error: testthat unit tests failed
     Execution halted
Flavor: r-patched-solaris-sparc

Version: 1.12.0
Check: tests
Result: ERROR
     Running ‘has-devel.R’
     Running ‘test-that.R’ [73s/105s]
    Running the tests in ‘tests/test-that.R’ failed.
    Last 13 lines of output:
     7: find_pkg_topic(path, topic)
     8: topic_index(pkg)
     9: build_topic_index(pkg)
     10: invert(lapply(rds, aliases))
    
     Updating collate directive in /tmp/Rtmp2ca4hm/testCollateOrder/DESCRIPTION
    
     testthat results ================================================================
     OK: 377 SKIPPED: 10 FAILED: 1
     1. Error: help and ? find files for devtools-loaded packages (@test-help.r#45)
    
     Error: testthat unit tests failed
     Execution halted
Flavor: r-patched-solaris-x86