CRAN Package Check Results for Package grattan

Last updated on 2018-02-25 00:48:43 CET.

Flavor Version Tinstall Tcheck Ttotal Status Flags
r-devel-linux-x86_64-debian-clang 1.5.3.7 65.39 212.51 277.90 NOTE
r-devel-linux-x86_64-debian-gcc 1.5.3.7 41.04 160.29 201.33 NOTE
r-devel-linux-x86_64-fedora-clang 1.5.3.7 343.75 NOTE
r-devel-linux-x86_64-fedora-gcc 1.5.3.7 314.36 NOTE
r-devel-windows-ix86+x86_64 1.5.3.5 109.00 256.00 365.00 NOTE
r-patched-linux-x86_64 1.5.3.7 49.22 218.10 267.32 NOTE
r-patched-solaris-x86 1.5.3.7 387.90 NOTE
r-release-linux-x86_64 1.5.3.7 52.41 211.80 264.21 NOTE
r-release-windows-ix86+x86_64 1.5.3.5 236.00 449.00 685.00 ERROR
r-release-osx-x86_64 1.5.3.7 NOTE
r-oldrel-windows-ix86+x86_64 1.5.3.5 160.00 344.00 504.00 ERROR
r-oldrel-osx-x86_64 1.5.2.5 NOTE

Check Details

Version: 1.5.3.7
Check: package dependencies
Result: NOTE
    Package suggested but not available for checking: ‘taxstats’
Flavors: r-devel-linux-x86_64-debian-clang, r-devel-linux-x86_64-debian-gcc, r-devel-linux-x86_64-fedora-clang, r-devel-linux-x86_64-fedora-gcc, r-patched-linux-x86_64, r-patched-solaris-x86, r-release-linux-x86_64, r-release-osx-x86_64

Version: 1.5.3.5
Check: package dependencies
Result: NOTE
    Package suggested but not available for checking: 'taxstats'
Flavor: r-devel-windows-ix86+x86_64

Version: 1.5.3.5
Check: for GNU extensions in Makefiles
Result: NOTE
    GNU make is a SystemRequirements.
Flavors: r-devel-windows-ix86+x86_64, r-release-windows-ix86+x86_64, r-oldrel-windows-ix86+x86_64

Version: 1.5.3.5
Check: running tests for arch ‘i386’
Result: ERROR
     Running 'testthat.R' [79s]
    Running the tests in 'tests/testthat.R' failed.
    Last 13 lines of output:
     -- 2. Error: Elasticity 0 vs 1 (@test_model_income_tax.R#545) -----------------
     object 'sample_file_1415_synth' not found
     1: copy(sample_file_1415_synth) %>% .[, `:=`(old_tax, income_tax(Taxable_Income, "2014-15",
     .dots.ATO = .))] %>% unique(by = "Ind") at testthat/test_model_income_tax.R:545
     2: eval(lhs, parent, parent)
     3: eval(lhs, parent, parent)
     4: copy(sample_file_1415_synth)
    
     == testthat results ===========================================================
     OK: 290 SKIPPED: 27 FAILED: 2
     1. Error: SAPTO modelled (@test_model_income_tax.R#378)
     2. Error: Elasticity 0 vs 1 (@test_model_income_tax.R#545)
    
     Error: testthat unit tests failed
     Execution halted
Flavor: r-release-windows-ix86+x86_64

Version: 1.5.3.5
Check: running tests for arch ‘x64’
Result: ERROR
     Running 'testthat.R' [75s]
    Running the tests in 'tests/testthat.R' failed.
    Last 13 lines of output:
     -- 2. Error: Elasticity 0 vs 1 (@test_model_income_tax.R#545) -----------------
     object 'sample_file_1415_synth' not found
     1: copy(sample_file_1415_synth) %>% .[, `:=`(old_tax, income_tax(Taxable_Income, "2014-15",
     .dots.ATO = .))] %>% unique(by = "Ind") at testthat/test_model_income_tax.R:545
     2: eval(lhs, parent, parent)
     3: eval(lhs, parent, parent)
     4: copy(sample_file_1415_synth)
    
     == testthat results ===========================================================
     OK: 290 SKIPPED: 27 FAILED: 2
     1. Error: SAPTO modelled (@test_model_income_tax.R#378)
     2. Error: Elasticity 0 vs 1 (@test_model_income_tax.R#545)
    
     Error: testthat unit tests failed
     Execution halted
Flavor: r-release-windows-ix86+x86_64

Version: 1.5.3.5
Check: running tests for arch ‘i386’
Result: ERROR
     Running 'testthat.R' [64s]
    Running the tests in 'tests/testthat.R' failed.
    Last 13 lines of output:
     -- 2. Error: Elasticity 0 vs 1 (@test_model_income_tax.R#545) -----------------
     object 'sample_file_1415_synth' not found
     1: copy(sample_file_1415_synth) %>% .[, `:=`(old_tax, income_tax(Taxable_Income, "2014-15",
     .dots.ATO = .))] %>% unique(by = "Ind") at testthat/test_model_income_tax.R:545
     2: eval(lhs, parent, parent)
     3: eval(expr, envir, enclos)
     4: copy(sample_file_1415_synth)
    
     == testthat results ===========================================================
     OK: 290 SKIPPED: 27 FAILED: 2
     1. Error: SAPTO modelled (@test_model_income_tax.R#378)
     2. Error: Elasticity 0 vs 1 (@test_model_income_tax.R#545)
    
     Error: testthat unit tests failed
     Execution halted
Flavor: r-oldrel-windows-ix86+x86_64

Version: 1.5.3.5
Check: running tests for arch ‘x64’
Result: ERROR
     Running 'testthat.R' [63s]
    Running the tests in 'tests/testthat.R' failed.
    Last 13 lines of output:
     -- 2. Error: Elasticity 0 vs 1 (@test_model_income_tax.R#545) -----------------
     object 'sample_file_1415_synth' not found
     1: copy(sample_file_1415_synth) %>% .[, `:=`(old_tax, income_tax(Taxable_Income, "2014-15",
     .dots.ATO = .))] %>% unique(by = "Ind") at testthat/test_model_income_tax.R:545
     2: eval(lhs, parent, parent)
     3: eval(expr, envir, enclos)
     4: copy(sample_file_1415_synth)
    
     == testthat results ===========================================================
     OK: 290 SKIPPED: 27 FAILED: 2
     1. Error: SAPTO modelled (@test_model_income_tax.R#378)
     2. Error: Elasticity 0 vs 1 (@test_model_income_tax.R#545)
    
     Error: testthat unit tests failed
     Execution halted
Flavor: r-oldrel-windows-ix86+x86_64

Version: 1.5.2.5
Check: package dependencies
Result: NOTE
    Package suggested but not available for checking: ‘taxstats’
Flavor: r-oldrel-osx-x86_64

Version: 1.5.2.5
Check: for GNU extensions in Makefiles
Result: NOTE
    GNU make is a SystemRequirements.
Flavor: r-oldrel-osx-x86_64