CRAN Package Check Results for Package SpaDES.core

Last updated on 2018-05-14 01:47:03 CEST.

Flavor Version Tinstall Tcheck Ttotal Status Flags
r-devel-linux-x86_64-debian-clang 0.1.1 32.29 345.58 377.87 ERROR
r-devel-linux-x86_64-debian-gcc 0.1.1 27.97 285.16 313.13 ERROR
r-devel-linux-x86_64-fedora-clang 0.1.1 485.36 ERROR
r-devel-linux-x86_64-fedora-gcc 0.1.1 477.84 ERROR
r-devel-windows-ix86+x86_64 0.1.1 73.00 480.00 553.00 ERROR
r-patched-linux-x86_64 0.1.1 27.43 350.01 377.44 ERROR
r-patched-solaris-x86 0.1.1 759.40 ERROR
r-release-linux-x86_64 0.1.1 26.29 342.64 368.93 ERROR
r-release-windows-ix86+x86_64 0.1.1 73.00 480.00 553.00 ERROR
r-release-osx-x86_64 0.1.1 ERROR
r-oldrel-windows-ix86+x86_64 0.1.1 48.00 362.00 410.00 ERROR
r-oldrel-osx-x86_64 0.1.1 WARN

Additional issues

rcnst

Check Details

Version: 0.1.1
Check: tests
Result: ERROR
     Running ‘test-all.R’ [158s/158s]
    Running the tests in ‘tests/test-all.R’ failed.
    Complete output:
     > library(testthat)
     > test_check("SpaDES.core")
     Loading required package: SpaDES.core
     Loading required package: quickPlot
     Loading required package: reproducible
    
     Attaching package: 'reproducible'
    
     The following object is masked from 'package:testthat':
    
     %>%
    
     Using cached copy of .inputObjects event in test module
     Using cached copy of .inputObjects event in test module
     ── 1. Failure: simList object initializes correctly (@test-simList.R#17) ──────────────────────────
     length(out) not equal to 75.
     1/1 mismatches
     [1] 73 - 75 == -2
    
     Using cached copy of burn event in fireSpread module
     ══ testthat results ═══════════════════════════════════════════════════════════
     OK: 349 SKIPPED: 33 FAILED: 1
     1. Failure: simList object initializes correctly (@test-simList.R#17)
    
     Error: testthat unit tests failed
     Execution halted
Flavor: r-devel-linux-x86_64-debian-clang

Version: 0.1.1
Check: tests
Result: ERROR
     Running ‘test-all.R’ [125s/189s]
    Running the tests in ‘tests/test-all.R’ failed.
    Complete output:
     > library(testthat)
     > test_check("SpaDES.core")
     Loading required package: SpaDES.core
     Loading required package: quickPlot
     Loading required package: reproducible
    
     Attaching package: 'reproducible'
    
     The following object is masked from 'package:testthat':
    
     %>%
    
     Registered S3 method overwritten by 'dplyr':
     method from
     as.data.frame.tbl_df tibble
     Registered S3 method overwritten by 'R.oo':
     method from
     throw.default R.methodsS3
     Using cached copy of .inputObjects event in test module
     Using cached copy of .inputObjects event in test module
     ── 1. Failure: simList object initializes correctly (@test-simList.R#17) ──────────────────────────
     length(out) not equal to 75.
     1/1 mismatches
     [1] 73 - 75 == -2
    
     Using cached copy of burn event in fireSpread module
     ══ testthat results ═══════════════════════════════════════════════════════════
     OK: 349 SKIPPED: 33 FAILED: 1
     1. Failure: simList object initializes correctly (@test-simList.R#17)
    
     Error: testthat unit tests failed
     Execution halted
Flavor: r-devel-linux-x86_64-debian-gcc

Version: 0.1.1
Check: dependencies in R code
Result: NOTE
    Namespace in Imports field not imported from: ‘sp’
     All declared Imports should be used.
Flavors: r-devel-linux-x86_64-fedora-clang, r-devel-linux-x86_64-fedora-gcc, r-patched-solaris-x86, r-release-osx-x86_64, r-oldrel-osx-x86_64

Version: 0.1.1
Check: tests
Result: ERROR
     Running ‘test-all.R’ [191s/228s]
    Running the tests in ‘tests/test-all.R’ failed.
    Complete output:
     > library(testthat)
     > test_check("SpaDES.core")
     Loading required package: SpaDES.core
     Loading required package: quickPlot
     Loading required package: reproducible
    
     Attaching package: 'reproducible'
    
     The following object is masked from 'package:testthat':
    
     %>%
    
     Using cached copy of .inputObjects event in test module
     Using cached copy of .inputObjects event in test module
     ── 1. Failure: simList object initializes correctly (@test-simList.R#17) ──────────────────────────
     length(out) not equal to 75.
     1/1 mismatches
     [1] 73 - 75 == -2
    
     Using cached copy of burn event in fireSpread module
     ══ testthat results ═══════════════════════════════════════════════════════════
     OK: 349 SKIPPED: 33 FAILED: 1
     1. Failure: simList object initializes correctly (@test-simList.R#17)
    
     Error: testthat unit tests failed
     Execution halted
Flavor: r-devel-linux-x86_64-fedora-clang

Version: 0.1.1
Check: tests
Result: ERROR
     Running ‘test-all.R’ [185s/217s]
    Running the tests in ‘tests/test-all.R’ failed.
    Complete output:
     > library(testthat)
     > test_check("SpaDES.core")
     Loading required package: SpaDES.core
     Loading required package: quickPlot
     Loading required package: reproducible
    
     Attaching package: 'reproducible'
    
     The following object is masked from 'package:testthat':
    
     %>%
    
     Using cached copy of .inputObjects event in test module
     Using cached copy of .inputObjects event in test module
     ── 1. Failure: simList object initializes correctly (@test-simList.R#17) ──────────────────────────
     length(out) not equal to 75.
     1/1 mismatches
     [1] 73 - 75 == -2
    
     Using cached copy of burn event in fireSpread module
     ══ testthat results ═══════════════════════════════════════════════════════════
     OK: 349 SKIPPED: 33 FAILED: 1
     1. Failure: simList object initializes correctly (@test-simList.R#17)
    
     Error: testthat unit tests failed
     Execution halted
Flavor: r-devel-linux-x86_64-fedora-gcc

Version: 0.1.1
Check: tests
Result: ERROR
     Running 'test-all.R' [170s]
    Running the tests in 'tests/test-all.R' failed.
    Complete output:
     > library(testthat)
     > test_check("SpaDES.core")
     Loading required package: SpaDES.core
     Loading required package: quickPlot
     Loading required package: reproducible
    
     Attaching package: 'reproducible'
    
     The following object is masked from 'package:testthat':
    
     %>%
    
     Using cached copy of .inputObjects event in test module
     Using cached copy of .inputObjects event in test module
     -- 1. Failure: simList object initializes correctly (@test-simList.R#17) --------------------------
     length(out) not equal to 75.
     1/1 mismatches
     [1] 73 - 75 == -2
    
     Using cached copy of burn event in fireSpread module
     == testthat results ===========================================================
     OK: 349 SKIPPED: 33 FAILED: 1
     1. Failure: simList object initializes correctly (@test-simList.R#17)
    
     Error: testthat unit tests failed
     Execution halted
Flavors: r-devel-windows-ix86+x86_64, r-release-windows-ix86+x86_64

Version: 0.1.1
Check: tests
Result: ERROR
     Running ‘test-all.R’ [167s/219s]
    Running the tests in ‘tests/test-all.R’ failed.
    Complete output:
     > library(testthat)
     > test_check("SpaDES.core")
     Loading required package: SpaDES.core
     Loading required package: quickPlot
     Loading required package: reproducible
    
     Attaching package: 'reproducible'
    
     The following object is masked from 'package:testthat':
    
     %>%
    
     Using cached copy of .inputObjects event in test module
     Using cached copy of .inputObjects event in test module
     ── 1. Failure: simList object initializes correctly (@test-simList.R#17) ──────────────────────────
     length(out) not equal to 75.
     1/1 mismatches
     [1] 73 - 75 == -2
    
     Using cached copy of burn event in fireSpread module
     ══ testthat results ═══════════════════════════════════════════════════════════
     OK: 349 SKIPPED: 33 FAILED: 1
     1. Failure: simList object initializes correctly (@test-simList.R#17)
    
     Error: testthat unit tests failed
     Execution halted
Flavor: r-patched-linux-x86_64

Version: 0.1.1
Check: tests
Result: ERROR
     Running ‘test-all.R’ [370s/505s]
    Running the tests in ‘tests/test-all.R’ failed.
    Complete output:
     > library(testthat)
     > test_check("SpaDES.core")
     Loading required package: SpaDES.core
     Loading required package: quickPlot
     Loading required package: reproducible
    
     Attaching package: 'reproducible'
    
     The following object is masked from 'package:testthat':
    
     %>%
    
     Using cached copy of .inputObjects event in test module
     Using cached copy of .inputObjects event in test module
     ── 1. Failure: simList object initializes correctly (@test-simList.R#17) ──────────────────────────
     length(out) not equal to 75.
     1/1 mismatches
     [1] 73 - 75 == -2
    
     Using cached copy of burn event in fireSpread module
     ══ testthat results ═══════════════════════════════════════════════════════════
     OK: 349 SKIPPED: 33 FAILED: 1
     1. Failure: simList object initializes correctly (@test-simList.R#17)
    
     Error: testthat unit tests failed
     Execution halted
Flavor: r-patched-solaris-x86

Version: 0.1.1
Check: re-building of vignette outputs
Result: WARN
    Error in re-building vignettes:
     ...
    Warning in engine$weave(file, quiet = quiet, encoding = enc) :
     Pandoc (>= 1.12.3) and/or pandoc-citeproc not available. Falling back to R Markdown v1.
    Warning in engine$weave(file, quiet = quiet, encoding = enc) :
     Pandoc (>= 1.12.3) and/or pandoc-citeproc not available. Falling back to R Markdown v1.
    
    Attaching package: 'igraph'
    
    The following objects are masked from 'package:stats':
    
     decompose, spectrum
    
    The following object is masked from 'package:base':
    
     union
    
    Loading required package: quickPlot
    Loading required package: reproducible
    
    Attaching package: 'reproducible'
    
    The following object is masked from 'package:igraph':
    
     %>%
    
    Loading required package: RColorBrewer
    Loading required package: raster
    Loading required package: sp
    Loading required package: grid
    
    Attaching package: 'grid'
    
    The following object is masked from 'package:quickPlot':
    
     gpar
    
    Quitting from lines 357-361 (ii-modules.Rmd)
    Error: processing vignette 'ii-modules.Rmd' failed with diagnostics:
    there is no package called 'webshot'
    Execution halted
Flavor: r-patched-solaris-x86

Version: 0.1.1
Check: tests
Result: ERROR
     Running ‘test-all.R’ [157s/202s]
    Running the tests in ‘tests/test-all.R’ failed.
    Complete output:
     > library(testthat)
     > test_check("SpaDES.core")
     Loading required package: SpaDES.core
     Loading required package: quickPlot
     Loading required package: reproducible
    
     Attaching package: 'reproducible'
    
     The following object is masked from 'package:testthat':
    
     %>%
    
     Using cached copy of .inputObjects event in test module
     Using cached copy of .inputObjects event in test module
     ── 1. Failure: simList object initializes correctly (@test-simList.R#17) ──────────────────────────
     length(out) not equal to 75.
     1/1 mismatches
     [1] 73 - 75 == -2
    
     Using cached copy of burn event in fireSpread module
     ══ testthat results ═══════════════════════════════════════════════════════════
     OK: 349 SKIPPED: 33 FAILED: 1
     1. Failure: simList object initializes correctly (@test-simList.R#17)
    
     Error: testthat unit tests failed
     Execution halted
Flavor: r-release-linux-x86_64

Version: 0.1.1
Check: tests
Result: ERROR
     Running ‘test-all.R’ [275s/483s]
    Running the tests in ‘tests/test-all.R’ failed.
    Last 13 lines of output:
     Using cached copy of .inputObjects event in test module
     Using cached copy of .inputObjects event in test module
     ── 1. Error: 3 levels of parent and child modules load and show correctly (@test
     At optimal_modularity.c:85 : GLPK is not available, Unimplemented function call
     1: moduleGraph(mySim, FALSE) at testthat/test-module-deps-methods.R:201
     2: moduleGraph(mySim, FALSE)
     3: cluster_optimal(grph)
    
     Using cached copy of burn event in fireSpread module
     ══ testthat results ═══════════════════════════════════════════════════════════
     OK: 344 SKIPPED: 33 FAILED: 1
     1. Error: 3 levels of parent and child modules load and show correctly (@test-module-deps-methods.R#201)
    
     Error: testthat unit tests failed
     Execution halted
Flavor: r-release-osx-x86_64

Version: 0.1.1
Check: re-building of vignette outputs
Result: WARN
    Error in re-building vignettes:
     ...
    
    Loading required package: quickPlot
    Loading required package: reproducible
    
    Attaching package: 'reproducible'
    
    The following object is masked from 'package:igraph':
    
     %>%
    
    Loading required package: RColorBrewer
    Loading required package: raster
    Loading required package: sp
    Loading required package: grid
    
    Attaching package: 'grid'
    
    The following object is masked from 'package:quickPlot':
    
     gpar
    
    Quitting from lines 357-361 (ii-modules.Rmd)
    Error: processing vignette 'ii-modules.Rmd' failed with diagnostics:
    cannot open the connection
    Execution halted
Flavors: r-release-osx-x86_64, r-oldrel-osx-x86_64

Version: 0.1.1
Check: tests
Result: ERROR
     Running 'test-all.R' [215s]
    Running the tests in 'tests/test-all.R' failed.
    Complete output:
     > library(testthat)
     > test_check("SpaDES.core")
     Loading required package: SpaDES.core
     Loading required package: quickPlot
     Loading required package: reproducible
    
     Attaching package: 'reproducible'
    
     The following object is masked from 'package:testthat':
    
     %>%
    
     Using cached copy of .inputObjects event in test module
     Using cached copy of .inputObjects event in test module
     -- 1. Failure: simList object initializes correctly (@test-simList.R#17) --------------------------
     length(out) not equal to 75.
     1/1 mismatches
     [1] 73 - 75 == -2
    
     Using cached copy of burn event in fireSpread module
     == testthat results ===========================================================
     OK: 349 SKIPPED: 33 FAILED: 1
     1. Failure: simList object initializes correctly (@test-simList.R#17)
    
     Error: testthat unit tests failed
     Execution halted
Flavor: r-oldrel-windows-ix86+x86_64