CRAN Package Check Results for Package rclimateca

Last updated on 2018-05-14 01:46:55 CEST.

Flavor Version Tinstall Tcheck Ttotal Status Flags
r-devel-linux-x86_64-debian-clang 1.0.1 4.75 65.27 70.02 ERROR
r-devel-linux-x86_64-debian-gcc 1.0.1 3.73 50.54 54.27 ERROR
r-devel-linux-x86_64-fedora-clang 1.0.1 79.55 ERROR
r-devel-linux-x86_64-fedora-gcc 1.0.1 90.81 ERROR
r-devel-windows-ix86+x86_64 1.0.1 11.00 145.00 156.00 ERROR
r-patched-linux-x86_64 1.0.1 4.34 65.38 69.72 ERROR
r-patched-solaris-x86 1.0.1 131.20 ERROR
r-release-linux-x86_64 1.0.1 2.94 69.59 72.53 ERROR
r-release-windows-ix86+x86_64 1.0.1 11.00 145.00 156.00 ERROR
r-release-osx-x86_64 1.0.1 NOTE
r-oldrel-windows-ix86+x86_64 1.0.1 11.00 139.00 150.00 ERROR
r-oldrel-osx-x86_64 1.0.1 NOTE

Check Details

Version: 1.0.1
Check: tests
Result: ERROR
     Running ‘test-all.R’ [23s/53s]
    Running the tests in ‘tests/test-all.R’ failed.
    Complete output:
     >
     > library(testthat)
     >
     > test_check("rclimateca")
     Loading required package: rclimateca
     ── 1. Failure: column types for ec_climate_data() are correct (@test-climate_dat
     hourly$data_quality inherits from `NULL` not `character`.
    
     ── 2. Failure: get mudata function for climate data works (@test-climate_data.R#
     colnames(mudata2::tbl_data(hourly)) not equal to c(...).
     Lengths differ: 7 is not 8
    
    
     |
     | | 0%
     |
     |====== | 8%
     |
     |============ | 17%
     |
     |================== | 25%
     |
     |======================= | 33%
     |
     |============================= | 42%
     |
     |=================================== | 50%
     |
     |========================================= | 58%
     |
     |=============================================== | 67%
     |
     |==================================================== | 75%
     |
     |========================================================== | 83%
     |
     |================================================================ | 92%
     |
     |======================================================================| 100%
    
     |
     | | 0%
     |
     |======================= | 33%
     |
     |=============================================== | 67%
     |
     |======================================================================| 100%
    
     |
     | | 0%
     |
     |======================= | 33%
     |
     |=============================================== | 67%
     |
     |======================================================================| 100%
    
     |
     | | 0%
     |
     |=================================== | 50%
     |
     |======================================================================| 100%
     ══ testthat results ═══════════════════════════════════════════════════════════
     OK: 187 SKIPPED: 0 FAILED: 2
     1. Failure: column types for ec_climate_data() are correct (@test-climate_data.R#123)
     2. Failure: get mudata function for climate data works (@test-climate_data.R#463)
    
     Error: testthat unit tests failed
     Execution halted
Flavor: r-devel-linux-x86_64-debian-clang

Version: 1.0.1
Check: tests
Result: ERROR
     Running ‘test-all.R’ [14s/37s]
    Running the tests in ‘tests/test-all.R’ failed.
    Complete output:
     >
     > library(testthat)
     >
     > test_check("rclimateca")
     Loading required package: rclimateca
     ── 1. Failure: column types for ec_climate_data() are correct (@test-climate_dat
     hourly$data_quality inherits from `NULL` not `character`.
    
     ── 2. Failure: get mudata function for climate data works (@test-climate_data.R#
     colnames(mudata2::tbl_data(hourly)) not equal to c(...).
     Lengths differ: 7 is not 8
    
    
     |
     | | 0%
     |
     |======================= | 33%
     |
     |=============================================== | 67%
     |
     |======================================================================| 100%
    
     |
     | | 0%
     |
     |======================= | 33%
     |
     |=============================================== | 67%
     |
     |======================================================================| 100%
    
     |
     | | 0%
     |
     |=================================== | 50%
     |
     |======================================================================| 100%
     ══ testthat results ═══════════════════════════════════════════════════════════
     OK: 187 SKIPPED: 0 FAILED: 2
     1. Failure: column types for ec_climate_data() are correct (@test-climate_data.R#123)
     2. Failure: get mudata function for climate data works (@test-climate_data.R#463)
    
     Error: testthat unit tests failed
     Execution halted
Flavor: r-devel-linux-x86_64-debian-gcc

Version: 1.0.1
Check: data for non-ASCII characters
Result: NOTE
     Note: found 24 marked UTF-8 strings
Flavors: r-devel-linux-x86_64-fedora-clang, r-devel-linux-x86_64-fedora-gcc, r-patched-solaris-x86, r-release-osx-x86_64, r-oldrel-osx-x86_64

Version: 1.0.1
Check: tests
Result: ERROR
     Running ‘test-all.R’ [18s/34s]
    Running the tests in ‘tests/test-all.R’ failed.
    Complete output:
     >
     > library(testthat)
     >
     > test_check("rclimateca")
     Loading required package: rclimateca
     ── 1. Failure: column types for ec_climate_data() are correct (@test-climate_dat
     hourly$data_quality inherits from `NULL` not `character`.
    
     ── 2. Failure: get mudata function for climate data works (@test-climate_data.R#
     colnames(mudata2::tbl_data(hourly)) not equal to c(...).
     Lengths differ: 7 is not 8
    
    
     |
     | | 0%
     |
     |======================= | 33%
     |
     |=============================================== | 67%
     |
     |======================================================================| 100%
    
     |
     | | 0%
     |
     |======================= | 33%
     |
     |=============================================== | 67%
     |
     |======================================================================| 100%
    
     |
     | | 0%
     |
     |=================================== | 50%
     |
     |======================================================================| 100%
     ══ testthat results ═══════════════════════════════════════════════════════════
     OK: 187 SKIPPED: 0 FAILED: 2
     1. Failure: column types for ec_climate_data() are correct (@test-climate_data.R#123)
     2. Failure: get mudata function for climate data works (@test-climate_data.R#463)
    
     Error: testthat unit tests failed
     Execution halted
Flavor: r-devel-linux-x86_64-fedora-clang

Version: 1.0.1
Check: tests
Result: ERROR
     Running ‘test-all.R’ [32s/84s]
    Running the tests in ‘tests/test-all.R’ failed.
    Complete output:
     >
     > library(testthat)
     >
     > test_check("rclimateca")
     Loading required package: rclimateca
     ── 1. Failure: column types for ec_climate_data() are correct (@test-climate_dat
     hourly$data_quality inherits from `NULL` not `character`.
    
     ── 2. Failure: get mudata function for climate data works (@test-climate_data.R#
     colnames(mudata2::tbl_data(hourly)) not equal to c(...).
     Lengths differ: 7 is not 8
    
    
     |
     | | 0%
     |
     |======================= | 33%
     |
     |=============================================== | 67%
     |
     |======================================================================| 100%
    
     |
     | | 0%
     |
     |======================= | 33%
     |
     |=============================================== | 67%
     |
     |======================================================================| 100%
    
     |
     | | 0%
     |
     |=================================== | 50%
     |
     |======================================================================| 100%
     ══ testthat results ═══════════════════════════════════════════════════════════
     OK: 187 SKIPPED: 0 FAILED: 2
     1. Failure: column types for ec_climate_data() are correct (@test-climate_data.R#123)
     2. Failure: get mudata function for climate data works (@test-climate_data.R#463)
    
     Error: testthat unit tests failed
     Execution halted
Flavor: r-devel-linux-x86_64-fedora-gcc

Version: 1.0.1
Check: tests
Result: ERROR
     Running 'test-all.R' [30s]
    Running the tests in 'tests/test-all.R' failed.
    Complete output:
     >
     > library(testthat)
     >
     > test_check("rclimateca")
     Loading required package: rclimateca
     -- 1. Failure: column types for ec_climate_data() are correct (@test-climate_dat
     hourly$data_quality inherits from `NULL` not `character`.
    
     -- 2. Failure: get mudata function for climate data works (@test-climate_data.R#
     colnames(mudata2::tbl_data(hourly)) not equal to c(...).
     Lengths differ: 7 is not 8
    
    
     |
     | | 0%
     |
     |======================= | 33%
     |
     |=============================================== | 67%
     |
     |======================================================================| 100%
    
     |
     | | 0%
     |
     |======================= | 33%
     |
     |=============================================== | 67%
     |
     |======================================================================| 100%
    
     |
     | | 0%
     |
     |=================================== | 50%
     |
     |======================================================================| 100%
     == testthat results ===========================================================
     OK: 187 SKIPPED: 0 FAILED: 2
     1. Failure: column types for ec_climate_data() are correct (@test-climate_data.R#123)
     2. Failure: get mudata function for climate data works (@test-climate_data.R#463)
    
     Error: testthat unit tests failed
     Execution halted
Flavors: r-devel-windows-ix86+x86_64, r-release-windows-ix86+x86_64

Version: 1.0.1
Check: tests
Result: ERROR
     Running ‘test-all.R’ [20s/49s]
    Running the tests in ‘tests/test-all.R’ failed.
    Complete output:
     >
     > library(testthat)
     >
     > test_check("rclimateca")
     Loading required package: rclimateca
     ── 1. Failure: column types for ec_climate_data() are correct (@test-climate_dat
     hourly$data_quality inherits from `NULL` not `character`.
    
     ── 2. Failure: get mudata function for climate data works (@test-climate_data.R#
     colnames(mudata2::tbl_data(hourly)) not equal to c(...).
     Lengths differ: 7 is not 8
    
    
     |
     | | 0%
     |
     |======================= | 33%
     |
     |=============================================== | 67%
     |
     |======================================================================| 100%
    
     |
     | | 0%
     |
     |======================= | 33%
     |
     |=============================================== | 67%
     |
     |======================================================================| 100%
    
     |
     | | 0%
     |
     |=================================== | 50%
     |
     |======================================================================| 100%
     ══ testthat results ═══════════════════════════════════════════════════════════
     OK: 187 SKIPPED: 0 FAILED: 2
     1. Failure: column types for ec_climate_data() are correct (@test-climate_data.R#123)
     2. Failure: get mudata function for climate data works (@test-climate_data.R#463)
    
     Error: testthat unit tests failed
     Execution halted
Flavor: r-patched-linux-x86_64

Version: 1.0.1
Check: tests
Result: ERROR
     Running ‘test-all.R’ [44s/130s]
    Running the tests in ‘tests/test-all.R’ failed.
    Complete output:
     >
     > library(testthat)
     >
     > test_check("rclimateca")
     Loading required package: rclimateca
     ── 1. Failure: column types for ec_climate_data() are correct (@test-climate_dat
     hourly$data_quality inherits from `NULL` not `character`.
    
     ── 2. Failure: get mudata function for climate data works (@test-climate_data.R#
     colnames(mudata2::tbl_data(hourly)) not equal to c(...).
     Lengths differ: 7 is not 8
    
    
     |
     | | 0%
     |
     |====== | 8%
     |
     |============ | 17%
     |
     |================== | 25%
     |
     |======================= | 33%
     |
     |============================= | 42%
     |
     |=================================== | 50%
     |
     |========================================= | 58%
     |
     |=============================================== | 67%
     |
     |==================================================== | 75%
     |
     |========================================================== | 83%
     |
     |================================================================ | 92%
     |
     |======================================================================| 100%
    
     |
     | | 0%
     |
     |======================= | 33%
     |
     |=============================================== | 67%
     |
     |======================================================================| 100%
    
     |
     | | 0%
     |
     |======================= | 33%
     |
     |=============================================== | 67%
     |
     |======================================================================| 100%
    
     |
     | | 0%
     |
     |=================================== | 50%
     |
     |======================================================================| 100%
     ══ testthat results ═══════════════════════════════════════════════════════════
     OK: 187 SKIPPED: 0 FAILED: 2
     1. Failure: column types for ec_climate_data() are correct (@test-climate_data.R#123)
     2. Failure: get mudata function for climate data works (@test-climate_data.R#463)
    
     Error: testthat unit tests failed
     Execution halted
Flavor: r-patched-solaris-x86

Version: 1.0.1
Check: tests
Result: ERROR
     Running ‘test-all.R’ [26s/58s]
    Running the tests in ‘tests/test-all.R’ failed.
    Complete output:
     >
     > library(testthat)
     >
     > test_check("rclimateca")
     Loading required package: rclimateca
     ── 1. Failure: column types for ec_climate_data() are correct (@test-climate_dat
     hourly$data_quality inherits from `NULL` not `character`.
    
     ── 2. Failure: get mudata function for climate data works (@test-climate_data.R#
     colnames(mudata2::tbl_data(hourly)) not equal to c(...).
     Lengths differ: 7 is not 8
    
    
     |
     | | 0%
     |
     |======================= | 33%
     |
     |=============================================== | 67%
     |
     |======================================================================| 100%
    
     |
     | | 0%
     |
     |======================= | 33%
     |
     |=============================================== | 67%
     |
     |======================================================================| 100%
    
     |
     | | 0%
     |
     |=================================== | 50%
     |
     |======================================================================| 100%
     ══ testthat results ═══════════════════════════════════════════════════════════
     OK: 187 SKIPPED: 0 FAILED: 2
     1. Failure: column types for ec_climate_data() are correct (@test-climate_data.R#123)
     2. Failure: get mudata function for climate data works (@test-climate_data.R#463)
    
     Error: testthat unit tests failed
     Execution halted
Flavor: r-release-linux-x86_64

Version: 1.0.1
Check: tests
Result: ERROR
     Running 'test-all.R' [205s]
    Running the tests in 'tests/test-all.R' failed.
    Complete output:
     >
     > library(testthat)
     >
     > test_check("rclimateca")
     Loading required package: rclimateca
     -- 1. Failure: column types for ec_climate_data() are correct (@test-climate_dat
     hourly$data_quality inherits from `NULL` not `character`.
    
     -- 2. Failure: get mudata function for climate data works (@test-climate_data.R#
     colnames(mudata2::tbl_data(hourly)) not equal to c(...).
     Lengths differ: 7 is not 8
    
    
     |
     | | 0%
     |
     |====== | 8%
     |
     |============ | 17%
     |
     |================== | 25%
     |
     |======================= | 33%
     |
     |============================= | 42%
     |
     |=================================== | 50%
     |
     |========================================= | 58%
     |
     |=============================================== | 67%
     |
     |==================================================== | 75%
     |
     |========================================================== | 83%
     |
     |================================================================ | 92%
     |
     |======================================================================| 100%
    
     |
     | | 0%
     |
     |======================= | 33%
     |
     |=============================================== | 67%
     |
     |======================================================================| 100%
    
     |
     | | 0%
     |
     |======================= | 33%
     |
     |=============================================== | 67%
     |
     |======================================================================| 100%
    
     |
     | | 0%
     |
     |=================================== | 50%
     |
     |======================================================================| 100%
     == testthat results ===========================================================
     OK: 189 SKIPPED: 0 FAILED: 2
     1. Failure: column types for ec_climate_data() are correct (@test-climate_data.R#123)
     2. Failure: get mudata function for climate data works (@test-climate_data.R#463)
    
     Error: testthat unit tests failed
     Execution halted
Flavor: r-oldrel-windows-ix86+x86_64