CRAN Package Check Results for Package SpaDES.tools

Last updated on 2019-03-14 00:46:58 CET.

Flavor Version Tinstall Tcheck Ttotal Status Flags
r-devel-linux-x86_64-debian-clang 0.3.1 44.56 236.77 281.33 ERROR
r-devel-linux-x86_64-debian-gcc 0.3.1 39.34 205.94 245.28 ERROR
r-devel-linux-x86_64-fedora-clang 0.3.1 332.02 ERROR
r-devel-linux-x86_64-fedora-gcc 0.3.1 309.01 ERROR
r-devel-windows-ix86+x86_64 0.3.1 82.00 345.00 427.00 ERROR
r-patched-linux-x86_64 0.3.1 39.00 229.37 268.37 OK
r-patched-solaris-x86 0.3.1 438.80 OK
r-release-linux-x86_64 OK
r-release-windows-ix86+x86_64 0.3.1 76.00 534.00 610.00 OK
r-release-osx-x86_64 0.3.1 OK
r-oldrel-windows-ix86+x86_64 0.3.1 96.00 529.00 625.00 OK
r-oldrel-osx-x86_64 0.3.1 OK

Check Details

Version: 0.3.1
Check: tests
Result: ERROR
     Running 'test-all.R' [85s/79s]
    Running the tests in 'tests/test-all.R' failed.
    Complete output:
     > library(testthat)
     > test_check("SpaDES.tools")
     Loading required package: SpaDES.tools
     -- 1. Failure: spread produces legal RasterLayer (@test-spread.R#60) ----------
     all(...) isn't true.
    
     -- 2. Failure: spreadProb with relative values does not work correctly (@test-sp
     sum(hab3[events1[] > 0]) > sum(hab3[events2[] > 0]) isn't true.
    
     -- 3. Failure: spread2 tests (@test-spread2.R#220) ----------------------------
     cht$p.value > 0.05 isn't true.
    
     [1] "Scales with number of starts, not maxSize of raster"
     -- 4. Failure: spread2 tests -- asymmetry (@test-spread2.R#710) ---------------
     circs[sams] == circs[ciCentre[] == 1] isn't true.
    
     == testthat results ===========================================================
     OK: 1048 SKIPPED: 11 FAILED: 4
     1. Failure: spread produces legal RasterLayer (@test-spread.R#60)
     2. Failure: spreadProb with relative values does not work correctly (@test-spread.R#1259)
     3. Failure: spread2 tests (@test-spread2.R#220)
     4. Failure: spread2 tests -- asymmetry (@test-spread2.R#710)
    
     Error: testthat unit tests failed
     Execution halted
Flavor: r-devel-linux-x86_64-debian-clang

Version: 0.3.1
Check: tests
Result: ERROR
     Running ‘test-all.R’ [87s/102s]
    Running the tests in ‘tests/test-all.R’ failed.
    Complete output:
     > library(testthat)
     > test_check("SpaDES.tools")
     Loading required package: SpaDES.tools
     ── 1. Failure: spread produces legal RasterLayer (@test-spread.R#60) ──────────
     all(...) isn't true.
    
     ── 2. Failure: spreadProb with relative values does not work correctly (@test-sp
     sum(hab3[events1[] > 0]) > sum(hab3[events2[] > 0]) isn't true.
    
     ── 3. Failure: spread2 tests (@test-spread2.R#220) ────────────────────────────
     cht$p.value > 0.05 isn't true.
    
     [1] "Scales with number of starts, not maxSize of raster"
     ── 4. Failure: spread2 tests -- asymmetry (@test-spread2.R#710) ───────────────
     circs[sams] == circs[ciCentre[] == 1] isn't true.
    
     ══ testthat results ═══════════════════════════════════════════════════════════
     OK: 1048 SKIPPED: 11 FAILED: 4
     1. Failure: spread produces legal RasterLayer (@test-spread.R#60)
     2. Failure: spreadProb with relative values does not work correctly (@test-spread.R#1259)
     3. Failure: spread2 tests (@test-spread2.R#220)
     4. Failure: spread2 tests -- asymmetry (@test-spread2.R#710)
    
     Error: testthat unit tests failed
     Execution halted
Flavor: r-devel-linux-x86_64-debian-gcc

Version: 0.3.1
Check: tests
Result: ERROR
     Running ‘test-all.R’ [80s/88s]
    Running the tests in ‘tests/test-all.R’ failed.
    Complete output:
     > library(testthat)
     > test_check("SpaDES.tools")
     Loading required package: SpaDES.tools
     OMP: Warning #96: Cannot form a team with 24 threads, using 2 instead.
     OMP: Hint Consider unsetting KMP_DEVICE_THREAD_LIMIT (KMP_ALL_THREADS), KMP_TEAMS_THREAD_LIMIT, and OMP_THREAD_LIMIT (if any are set).
     ── 1. Failure: spread produces legal RasterLayer (@test-spread.R#60) ──────────
     all(...) isn't true.
    
     ── 2. Failure: spreadProb with relative values does not work correctly (@test-sp
     sum(hab3[events1[] > 0]) > sum(hab3[events2[] > 0]) isn't true.
    
     ── 3. Failure: spread2 tests (@test-spread2.R#220) ────────────────────────────
     cht$p.value > 0.05 isn't true.
    
     [1] "Scales with number of starts, not maxSize of raster"
     ── 4. Failure: spread2 tests -- asymmetry (@test-spread2.R#710) ───────────────
     circs[sams] == circs[ciCentre[] == 1] isn't true.
    
     ══ testthat results ═══════════════════════════════════════════════════════════
     OK: 1048 SKIPPED: 11 FAILED: 4
     1. Failure: spread produces legal RasterLayer (@test-spread.R#60)
     2. Failure: spreadProb with relative values does not work correctly (@test-spread.R#1259)
     3. Failure: spread2 tests (@test-spread2.R#220)
     4. Failure: spread2 tests -- asymmetry (@test-spread2.R#710)
    
     Error: testthat unit tests failed
     Execution halted
Flavor: r-devel-linux-x86_64-fedora-clang

Version: 0.3.1
Check: tests
Result: ERROR
     Running ‘test-all.R’ [77s/84s]
    Running the tests in ‘tests/test-all.R’ failed.
    Complete output:
     > library(testthat)
     > test_check("SpaDES.tools")
     Loading required package: SpaDES.tools
     ── 1. Failure: spread produces legal RasterLayer (@test-spread.R#60) ──────────
     all(...) isn't true.
    
     ── 2. Failure: spreadProb with relative values does not work correctly (@test-sp
     sum(hab3[events1[] > 0]) > sum(hab3[events2[] > 0]) isn't true.
    
     ── 3. Failure: spread2 tests (@test-spread2.R#220) ────────────────────────────
     cht$p.value > 0.05 isn't true.
    
     [1] "Scales with number of starts, not maxSize of raster"
     ── 4. Failure: spread2 tests -- asymmetry (@test-spread2.R#710) ───────────────
     circs[sams] == circs[ciCentre[] == 1] isn't true.
    
     ══ testthat results ═══════════════════════════════════════════════════════════
     OK: 1048 SKIPPED: 11 FAILED: 4
     1. Failure: spread produces legal RasterLayer (@test-spread.R#60)
     2. Failure: spreadProb with relative values does not work correctly (@test-spread.R#1259)
     3. Failure: spread2 tests (@test-spread2.R#220)
     4. Failure: spread2 tests -- asymmetry (@test-spread2.R#710)
    
     Error: testthat unit tests failed
     Execution halted
Flavor: r-devel-linux-x86_64-fedora-gcc

Version: 0.3.1
Check: running tests for arch ‘i386’
Result: ERROR
     Running 'test-all.R' [64s]
    Running the tests in 'tests/test-all.R' failed.
    Complete output:
     > library(testthat)
     > test_check("SpaDES.tools")
     Loading required package: SpaDES.tools
     -- 1. Failure: spread produces legal RasterLayer (@test-spread.R#60) ----------
     all(...) isn't true.
    
     -- 2. Failure: spreadProb with relative values does not work correctly (@test-sp
     sum(hab3[events1[] > 0]) > sum(hab3[events2[] > 0]) isn't true.
    
     -- 3. Failure: spread2 tests (@test-spread2.R#220) ----------------------------
     cht$p.value > 0.05 isn't true.
    
     [1] "Scales with number of starts, not maxSize of raster"
     -- 4. Failure: spread2 tests -- asymmetry (@test-spread2.R#710) ---------------
     circs[sams] == circs[ciCentre[] == 1] isn't true.
    
     == testthat results ===========================================================
     OK: 1048 SKIPPED: 11 FAILED: 4
     1. Failure: spread produces legal RasterLayer (@test-spread.R#60)
     2. Failure: spreadProb with relative values does not work correctly (@test-spread.R#1259)
     3. Failure: spread2 tests (@test-spread2.R#220)
     4. Failure: spread2 tests -- asymmetry (@test-spread2.R#710)
    
     Error: testthat unit tests failed
     Execution halted
Flavor: r-devel-windows-ix86+x86_64

Version: 0.3.1
Check: running tests for arch ‘x64’
Result: ERROR
     Running 'test-all.R' [68s]
    Running the tests in 'tests/test-all.R' failed.
    Complete output:
     > library(testthat)
     > test_check("SpaDES.tools")
     Loading required package: SpaDES.tools
     -- 1. Failure: spread produces legal RasterLayer (@test-spread.R#60) ----------
     all(...) isn't true.
    
     -- 2. Failure: spreadProb with relative values does not work correctly (@test-sp
     sum(hab3[events1[] > 0]) > sum(hab3[events2[] > 0]) isn't true.
    
     -- 3. Failure: spread2 tests (@test-spread2.R#220) ----------------------------
     cht$p.value > 0.05 isn't true.
    
     [1] "Scales with number of starts, not maxSize of raster"
     -- 4. Failure: spread2 tests -- asymmetry (@test-spread2.R#710) ---------------
     circs[sams] == circs[ciCentre[] == 1] isn't true.
    
     == testthat results ===========================================================
     OK: 1048 SKIPPED: 11 FAILED: 4
     1. Failure: spread produces legal RasterLayer (@test-spread.R#60)
     2. Failure: spreadProb with relative values does not work correctly (@test-spread.R#1259)
     3. Failure: spread2 tests (@test-spread2.R#220)
     4. Failure: spread2 tests -- asymmetry (@test-spread2.R#710)
    
     Error: testthat unit tests failed
     Execution halted
Flavor: r-devel-windows-ix86+x86_64