CRAN Package Check Results for Package prioritizr

Last updated on 2019-05-01 01:51:58 CEST.

Flavor Version Tinstall Tcheck Ttotal Status Flags
r-devel-linux-x86_64-debian-clang 4.0.4 299.77 394.56 694.33 NOTE
r-devel-linux-x86_64-debian-gcc 4.0.4 252.03 292.26 544.29 NOTE
r-devel-linux-x86_64-fedora-clang 4.0.4 932.83 NOTE
r-devel-linux-x86_64-fedora-gcc 4.0.4 930.31 NOTE
r-patched-linux-x86_64 4.0.4 290.44 385.32 675.76 NOTE
r-patched-solaris-x86 4.0.4 1014.10 ERROR
r-release-linux-x86_64 4.0.4 288.18 384.26 672.44 NOTE
r-release-windows-ix86+x86_64 4.0.4 805.00 914.00 1719.00 NOTE
r-release-osx-x86_64 4.0.4 ERROR
r-oldrel-windows-ix86+x86_64 4.0.4 810.00 892.00 1702.00 NOTE
r-oldrel-osx-x86_64 4.0.4 ERROR

Check Details

Version: 4.0.4
Check: package dependencies
Result: NOTE
    Package suggested but not available for checking: 'gurobi'
Flavors: r-devel-linux-x86_64-debian-clang, r-devel-linux-x86_64-debian-gcc, r-devel-linux-x86_64-fedora-clang, r-devel-linux-x86_64-fedora-gcc, r-patched-linux-x86_64, r-release-linux-x86_64, r-release-windows-ix86+x86_64, r-oldrel-windows-ix86+x86_64

Version: 4.0.4
Check: installed package size
Result: NOTE
     installed size is 14.5Mb
     sub-directories of 1Mb or more:
     doc 1.2Mb
     libs 11.5Mb
Flavors: r-devel-linux-x86_64-fedora-clang, r-release-windows-ix86+x86_64, r-release-osx-x86_64, r-oldrel-windows-ix86+x86_64, r-oldrel-osx-x86_64

Version: 4.0.4
Check: package dependencies
Result: NOTE
    Packages suggested but not available for checking:
     'gurobi', 'lpsymphony', 'Rsymphony'
Flavors: r-patched-solaris-x86, r-release-osx-x86_64

Version: 4.0.4
Check: tests
Result: ERROR
     Running ‘testthat.R’ [325s/399s]
    Running the tests in ‘tests/testthat.R’ failed.
    Complete output:
     > # load packages
     > library(testthat)
     > library(prioritizr)
     Loading required package: raster
     Loading required package: sp
     Loading required package: proto
     >
     > # load solver packages
     > require(gurobi)
     Loading required package: gurobi
     Warning message:
     In library(package, lib.loc = lib.loc, character.only = TRUE, logical.return = TRUE, :
     there is no package called 'gurobi'
     > require(lpsymphony)
     Loading required package: lpsymphony
     Warning message:
     In library(package, lib.loc = lib.loc, character.only = TRUE, logical.return = TRUE, :
     there is no package called 'lpsymphony'
     > require(Rsymphony)
     Loading required package: Rsymphony
     Warning message:
     In library(package, lib.loc = lib.loc, character.only = TRUE, logical.return = TRUE, :
     there is no package called 'Rsymphony'
     >
     > # enable parallel testing
     > Sys.unsetenv("R_TESTS")
     >
     > # run tests
     > test_check("prioritizr")
     list()
     attr(,"class")
     [1] "Waiver"
     Error in x$.self$finalize() : attempt to apply non-function
     Error in x$.self$finalize() : attempt to apply non-function
     Error in x$.self$finalize() : attempt to apply non-function
     Error in x$.self$finalize() : attempt to apply non-function
     ── 1. Error: get parameter methods (@test_problem.R#821) ──────────────────────
     parameter with matching name not found
     1: x$solver$parameters$find("gap") at testthat/test_problem.R:821
     2: res(x, ...)
     3: stop("parameter with matching name not found")
    
     ── 2. Error: set parameter methods (@test_problem.R#844) ──────────────────────
     parameter with matching name not found
     1: x$solver$parameters$find("gap") at testthat/test_problem.R:844
     2: res(x, ...)
     3: stop("parameter with matching name not found")
    
     ── 3. Error: render parameter methods (@test_problem.R#880) ───────────────────
     parameter with matching name not found
     1: x$solver$parameters$find("gap") at testthat/test_problem.R:880
     2: res(x, ...)
     3: stop("parameter with matching name not found")
    
     ..
     ..
     ..
     ══ testthat results ═══════════════════════════════════════════════════════════
     OK: 11583 SKIPPED: 117 WARNINGS: 0 FAILED: 3
     1. Error: get parameter methods (@test_problem.R#821)
     2. Error: set parameter methods (@test_problem.R#844)
     3. Error: render parameter methods (@test_problem.R#880)
    
     Error: testthat unit tests failed
     Execution halted
Flavor: r-patched-solaris-x86

Version: 4.0.4
Check: tests
Result: ERROR
     Running ‘testthat.R’ [198s/317s]
    Running the tests in ‘tests/testthat.R’ failed.
    Last 13 lines of output:
     1: x$solver$parameters$find("gap") at testthat/test_problem.R:880
     2: res(x, ...)
     3: stop("parameter with matching name not found")
    
     ..
     ..
     ..
     ══ testthat results ═══════════════════════════════════════════════════════════
     OK: 11583 SKIPPED: 117 FAILED: 3
     1. Error: get parameter methods (@test_problem.R#821)
     2. Error: set parameter methods (@test_problem.R#844)
     3. Error: render parameter methods (@test_problem.R#880)
    
     Error: testthat unit tests failed
     Execution halted
Flavor: r-release-osx-x86_64

Version: 4.0.4
Check: package dependencies
Result: NOTE
    Packages suggested but not available for checking:
     ‘gurobi’ ‘lpsymphony’ ‘Rsymphony’
Flavor: r-oldrel-osx-x86_64

Version: 4.0.4
Check: tests
Result: ERROR
     Running ‘testthat.R’ [145s/158s]
    Running the tests in ‘tests/testthat.R’ failed.
    Last 13 lines of output:
     1: x$solver$parameters$find("gap") at testthat/test_problem.R:880
     2: res(x, ...)
     3: stop("parameter with matching name not found")
    
     ..
     ..
     ..
     ══ testthat results ═══════════════════════════════════════════════════════════
     OK: 11583 SKIPPED: 117 WARNINGS: 0 FAILED: 3
     1. Error: get parameter methods (@test_problem.R#821)
     2. Error: set parameter methods (@test_problem.R#844)
     3. Error: render parameter methods (@test_problem.R#880)
    
     Error: testthat unit tests failed
     Execution halted
Flavor: r-oldrel-osx-x86_64